Target
Glutamate receptor ionotropic, NMDA 2C
Ligand
BDBM50440061
Substrate
Meas. Tech.
ChEMBL_983748 (CHEMBL2427901)
IC50
3000±n/a nM
Citation
 Acker, TMKhatri, AVance, KMSlabber, CBacsa, JSnyder, JPTraynelis, SFLiotta, DC Structure-activity relationships and pharmacophore model of a noncompetitive pyrazoline containing class of GluN2C/GluN2D selective antagonists. J Med Chem 56:6434-56 (2013)  
Target
Name:
Glutamate receptor ionotropic, NMDA 2C
Synonyms:
Glutamate NMDA receptor; Grin1/Grin2c Grin2c NMDE3_RAT
Type:
Protein
Mol. Mass.:
135305.94
Organism:
Rattus norvegicus (Rat)
Description:
Q00961
Residue:
1237
  
Inhibitor
Name:
BDBM50440061
Synonyms:
CHEMBL2424674
Type:
Small organic molecule
Emp. Form.:
C28H23Cl2N3O3
Mol. Mass.:
520.407
SMILES:
OC(=O)CCCN1N=C(CC1c1ccc(Cl)cc1)c1c(-c2ccc(Cl)cc2)c2ccccc2[nH]c1=O
: