Target
Glutamate receptor ionotropic, NMDA 2D
Ligand
BDBM50440066
Substrate
Meas. Tech.
ChEMBL_983749 (CHEMBL2427902)
IC50
95000±n/a nM
Citation
 Acker, TMKhatri, AVance, KMSlabber, CBacsa, JSnyder, JPTraynelis, SFLiotta, DC Structure-activity relationships and pharmacophore model of a noncompetitive pyrazoline containing class of GluN2C/GluN2D selective antagonists. J Med Chem 56:6434-56 (2013)  
Target
Name:
Glutamate receptor ionotropic, NMDA 2D
Synonyms:
GluN2D Grin2d NMDAR2D | NMDE4_RAT
Type:
Protein
Mol. Mass.:
143129.52
Organism:
Rattus norvegicus (Rat)
Description:
Q62645
Residue:
1323
  
Inhibitor
Name:
BDBM50440066
Synonyms:
CHEMBL2426074
Type:
Small organic molecule
Emp. Form.:
C29H21BrClN3O4
Mol. Mass.:
590.852
SMILES:
COC(=O)C=CC(=O)N1N=C(CC1c1ccc(Cl)cc1)c1c(-c2ccc(Br)cc2)c2ccccc2[nH]c1=O
: