Target
Glutamate receptor ionotropic, NMDA 2A
Ligand
BDBM50440076
Substrate
Meas. Tech.
ChEMBL_983746 (CHEMBL2427899)
IC50
19000±n/a nM
Citation
 Acker, TMKhatri, AVance, KMSlabber, CBacsa, JSnyder, JPTraynelis, SFLiotta, DC Structure-activity relationships and pharmacophore model of a noncompetitive pyrazoline containing class of GluN2C/GluN2D selective antagonists. J Med Chem 56:6434-56 (2013)  
Target
Name:
Glutamate receptor ionotropic, NMDA 2A
Synonyms:
Glutamate NMDA receptor; Grin1/Grin2a Grin2a NMDE1_RAT
Type:
Protein
Mol. Mass.:
165478.25
Organism:
Rattus norvegicus (Rat)
Description:
Q00959
Residue:
1464
  
Inhibitor
Name:
BDBM50440076
Synonyms:
CHEMBL2425978
Type:
Small organic molecule
Emp. Form.:
C28H20Cl2FN3O4
Mol. Mass.:
552.381
SMILES:
OC(=O)CCC(=O)N1N=C(CC1c1ccc(Cl)cc1)c1c(-c2ccc(F)c(Cl)c2)c2ccccc2[nH]c1=O
: