Target
Deoxycytidine kinase
Ligand
BDBM50440141
Substrate
Meas. Tech.
ChEMBL_981694 (CHEMBL2429676)
IC50
2367±n/a nM
Citation
 Murphy, JMArmijo, ALNomme, JLee, CHSmith, QALi, ZCampbell, DOLiao, HINathanson, DAAustin, WRLee, JTDarvish, RWei, LWang, JSu, YDamoiseaux, RSadeghi, SPhelps, MEHerschman, HRCzernin, JAlexandrova, ANJung, MELavie, ARadu, CG Development of new deoxycytidine kinase inhibitors and noninvasive in vivo evaluation using positron emission tomography. J Med Chem 56:6696-708 (2013)  
Target
Name:
Deoxycytidine kinase
Synonyms:
DCK | DCK_HUMAN
Type:
PROTEIN
Mol. Mass.:
30510.65
Organism:
Homo sapiens (Human)
Description:
ChEMBL_1437135
Residue:
260
  
Inhibitor
Name:
BDBM50440141
Synonyms:
CHEMBL2426587
Type:
Small organic molecule
Emp. Form.:
C17H18FN5O2S2
Mol. Mass.:
407.486
SMILES:
COc1cc(OCCF)ccc1-c1nc(CSc2nc(N)cc(N)n2)cs1
: