Target
Deoxycytidine kinase
Ligand
BDBM50440162
Substrate
Meas. Tech.
ChEMBL_981695 (CHEMBL2429677)
IC50
255±n/a nM
Citation
 Murphy, JMArmijo, ALNomme, JLee, CHSmith, QALi, ZCampbell, DOLiao, HINathanson, DAAustin, WRLee, JTDarvish, RWei, LWang, JSu, YDamoiseaux, RSadeghi, SPhelps, MEHerschman, HRCzernin, JAlexandrova, ANJung, MELavie, ARadu, CG Development of new deoxycytidine kinase inhibitors and noninvasive in vivo evaluation using positron emission tomography. J Med Chem 56:6696-708 (2013)  
Target
Name:
Deoxycytidine kinase
Synonyms:
DCK_MOUSE | Dck
Type:
PROTEIN
Mol. Mass.:
30361.42
Organism:
Mus musculus
Description:
ChEMBL_981695
Residue:
260
  
Inhibitor
Name:
BDBM50440162
Synonyms:
CHEMBL2426591
Type:
Small organic molecule
Emp. Form.:
C15H14FN5S2
Mol. Mass.:
347.434
SMILES:
Cc1sc(nc1CSc1nc(N)cc(N)n1)-c1cccc(F)c1
: