Target
Lysine-specific demethylase 2A
Ligand
BDBM50440287
Substrate
Meas. Tech.
ChEMBL_982479 (CHEMBL2427605)
IC50
8000±n/a nM
Citation
 Suzuki, TOzasa, HItoh, YZhan, PSawada, HMino, KWalport, LOhkubo, RKawamura, AYonezawa, MTsukada, YTumber, ANakagawa, HHasegawa, MSasaki, RMizukami, TSchofield, CJMiyata, N Identification of the KDM2/7 histone lysine demethylase subfamily inhibitor and its antiproliferative activity. J Med Chem 56:7222-31 (2013)  
Target
Name:
Lysine-specific demethylase 2A
Synonyms:
AA1-1162 F-box and leucine-rich repeat protein 11 FBL7 Homo sapiens lysine demethylase 2A (KDM2A) KDM2A KIAA1004 Lysine-specific demethylase 2A (KDM2A) | NM_012308
Type:
Enzyme Catalytic Domain
Mol. Mass.:
132809.04
Organism:
Homo sapiens (Human)
Description:
Residue:
1162
  
Inhibitor
Name:
BDBM50440287
Synonyms:
CHEMBL2424814
Type:
Small organic molecule
Emp. Form.:
C18H33NO4
Mol. Mass.:
327.4589
SMILES:
ON(CCC(O)=O)C(=O)CCCCCCCCC1CCCCC1
: