Target
Cytochrome P450 2C9
Ligand
BDBM50440358
Substrate
Meas. Tech.
ChEMBL_983549 (CHEMBL2429619)
IC50
>10000±n/a nM
Citation
 Grädler, UBomke, JMusil, DDresing, VLehmann, MHölzemann, GGreiner, HEsdar, CKrier, MHeinrich, T Fragment-based discovery of focal adhesion kinase inhibitors. Bioorg Med Chem Lett 23:5401-9 (2013)  
Target
Name:
Cytochrome P450 2C9
Synonyms:
(R)-limonene 6-monooxygenase CP2C9_HUMAN CYP2C9 Cytochrome P450 2C9 (CYP2C9 ) P-450MP P450 PB-1 | S-mephenytoin 4-hydroxylase
Type:
Enzyme
Mol. Mass.:
55636.33
Organism:
Homo sapiens (Human)
Description:
P11712
Residue:
490
  
Inhibitor
Name:
BDBM50440358
Synonyms:
CHEMBL2425156
Type:
Small organic molecule
Emp. Form.:
C26H27N5O
Mol. Mass.:
425.5255
SMILES:
Cc1ccc(cc1)-n1nc(cc1NC(=O)Nc1ccc(cc1)-c1cccnc1)C(C)(C)C
: