Target
Focal adhesion kinase 1
Ligand
BDBM50440365
Substrate
Meas. Tech.
ChEMBL_983668 (CHEMBL2427448)
IC50
>10000±n/a nM
Citation
 Grädler, UBomke, JMusil, DDresing, VLehmann, MHölzemann, GGreiner, HEsdar, CKrier, MHeinrich, T Fragment-based discovery of focal adhesion kinase inhibitors. Bioorg Med Chem Lett 23:5401-9 (2013)  
Target
Name:
Focal adhesion kinase 1
Synonyms:
FADK 1 FAK1 FLT4 Focal adhesion kinase (FAK) Focal adhesion kinase 1 (FAK) Focal adhesion kinase-related nonkinase PTK2 Protein-tyrosine kinase 2 p125FAK | pp125FAK
Type:
Tyrosine-protein kinase
Mol. Mass.:
119233.17
Organism:
Homo sapiens (Human)
Description:
Q05397
Residue:
1052
  
Inhibitor
Name:
BDBM50440365
Synonyms:
CHEMBL2425149
Type:
Small organic molecule
Emp. Form.:
C24H24Cl2N6O
Mol. Mass.:
483.393
SMILES:
Cc1ccc(cc1)-n1nc(cc1NC(=O)Nc1ccc(cc1)-n1cnc(Cl)c1Cl)C(C)(C)C
: