Target
Transient receptor potential cation channel subfamily V member 1
Ligand
BDBM50440397
Substrate
Meas. Tech.
ChEMBL_982064 (CHEMBL2428539)
Ki
1.6±n/a nM
Citation
 Lim, KSLee, HKim, SEHa, THAnn, JSon, KChoi, SSun, WPearce, LVDeAndrea-Lazarus, IABlumberg, PMLee, J The carbonate analogues of 5'-halogenated resiniferatoxin as TRPV1 ligands. Eur J Med Chem 68:233-43 (2013)  
Target
Name:
Transient receptor potential cation channel subfamily V member 1
Synonyms:
Capsaicin receptor TRPV1_RAT Trpv1 Vanilloid VR1 Vanilloid receptor 1 (VRI/TRPV1) Vanilloid receptor type 1-like (TrpV1/Vr1) Vr1l | osm-9-like TRP channel 1
Type:
Transient Receptor
Mol. Mass.:
94956.12
Organism:
Rattus norvegicus (rat)
Description:
O35433
Residue:
838
  
Inhibitor
Name:
BDBM50440397
Synonyms:
CHEMBL2425549
Type:
Small organic molecule
Emp. Form.:
C36H37BrO10
Mol. Mass.:
709.577
SMILES:
COc1cc(OC(=O)OCC2=C[C@H]3[C@H]4O[C@]5(Cc6ccccc6)O[C@]4(C[C@@H](C)[C@]3(O5)[C@@H]3C=C(C)C(=O)[C@@]3(O)C2)C(C)=C)cc(Br)c1O
: