Target
C-C motif chemokine 2
Ligand
BDBM50257992
Substrate
Meas. Tech.
ChEMBL_983389 (CHEMBL2428943)
Ki
50±n/a nM
Citation
 Vilums, MZweemer, AJYu, Zde Vries, HHillger, JMWapenaar, HBollen, IABarmare, FGross, RClemens, JKrenitsky, PBrussee, JStamos, DSaunders, JHeitman, LHIjzerman, AP Structure-kinetic relationships--an overlooked parameter in hit-to-lead optimization: a case of cyclopentylamines as chemokine receptor 2 antagonists. J Med Chem 56:7706-14 (2013)  
Target
Name:
C-C motif chemokine 2
Synonyms:
CCL2 HC11 MCP-1 Monocyte chemoattractant protein 1 Monocyte chemotactic protein 1 SCYA2 | Small-inducible cytokine A2
Type:
PROTEIN
Mol. Mass.:
11032.44
Organism:
Homo sapiens (Human)
Description:
ChEMBL_1363188
Residue:
99
  
Inhibitor
Name:
BDBM50257992
Synonyms:
(1S,3R)-N-(3,5-bis(trifluoromethyl)benzyl)-3-(2,3-dihydro-1H-inden-1-ylamino)-1-isopropylcyclopentanecarboxamide | CHEMBL494019
Type:
Small organic molecule
Emp. Form.:
C27H30F6N2O
Mol. Mass.:
512.5303
SMILES:
CC(C)[C@@]1(CC[C@H](C1)NC1CCc2ccccc12)C(=O)NCc1cc(cc(c1)C(F)(F)F)C(F)(F)F
: