Target
Scm-like with four MBT domains protein 1
Ligand
BDBM50440605
Substrate
Meas. Tech.
ChEMBL_983406 (CHEMBL2429076)
IC50
>10000±n/a nM
Citation
 James, LIKorboukh, VKKrichevsky, LBaughman, BMHerold, JMNorris, JLJin, JKireev, DBJanzen, WPArrowsmith, CHFrye, SV Small-molecule ligands of methyl-lysine binding proteins: optimization of selectivity for L3MBTL3. J Med Chem 56:7358-71 (2013)  
Target
Name:
Scm-like with four MBT domains protein 1
Synonyms:
RU1 SFMBT1 hSFMBT
Type:
PROTEIN
Mol. Mass.:
98135.34
Organism:
Homo sapiens (Human)
Description:
ChEMBL_104121
Residue:
866
  
Inhibitor
Name:
BDBM50440605
Synonyms:
CHEMBL2424677
Type:
Small organic molecule
Emp. Form.:
C33H39N5O2
Mol. Mass.:
537.6951
SMILES:
CCN1Cc2ccc(NC(=O)c3ccc(C(=O)N4CCC(CC4)C4CCCN4)c(Nc4ccccc4)c3)cc2C1
: