Target
Scm-like with four MBT domains protein 1
Ligand
BDBM50440561
Substrate
Meas. Tech.
ChEMBL_983406 (CHEMBL2429076)
IC50
>10000±n/a nM
Citation
 James, LIKorboukh, VKKrichevsky, LBaughman, BMHerold, JMNorris, JLJin, JKireev, DBJanzen, WPArrowsmith, CHFrye, SV Small-molecule ligands of methyl-lysine binding proteins: optimization of selectivity for L3MBTL3. J Med Chem 56:7358-71 (2013)  
Target
Name:
Scm-like with four MBT domains protein 1
Synonyms:
RU1 SFMBT1 hSFMBT
Type:
PROTEIN
Mol. Mass.:
98135.34
Organism:
Homo sapiens (Human)
Description:
ChEMBL_104121
Residue:
866
  
Inhibitor
Name:
BDBM50440561
Synonyms:
CHEMBL2426362
Type:
Small organic molecule
Emp. Form.:
C24H36N4O3
Mol. Mass.:
428.5676
SMILES:
O=C(N1CCC(CC1)N1CCCC1)c1ccc(o1)C(=O)N1CCC(CC1)N1CCCC1
: