Target
Chromobox protein homolog 7
Ligand
BDBM50440611
Substrate
Meas. Tech.
ChEMBL_983405 (CHEMBL2429075)
IC50
>10000±n/a nM
Citation
 James, LIKorboukh, VKKrichevsky, LBaughman, BMHerold, JMNorris, JLJin, JKireev, DBJanzen, WPArrowsmith, CHFrye, SV Small-molecule ligands of methyl-lysine binding proteins: optimization of selectivity for L3MBTL3. J Med Chem 56:7358-71 (2013)  
Target
Name:
Chromobox protein homolog 7
Synonyms:
CBX7 Chromobox protein homolog 7 | Chromobox protein homolog 7 (CBX7)
Type:
Protein
Mol. Mass.:
28351.76
Organism:
Homo sapiens (Human)
Description:
Residue:
251
  
Inhibitor
Name:
BDBM50440611
Synonyms:
CHEMBL2426367
Type:
Small organic molecule
Emp. Form.:
C32H42N4O3
Mol. Mass.:
530.7009
SMILES:
O=C(N1CCC(CC1)N1CCCC1)c1ccc(C(=O)N2CCC(CC2)N2CCCC2)c(Oc2ccccc2)c1
: