Target
MBT domain-containing protein 1
Ligand
BDBM50440605
Substrate
Meas. Tech.
ChEMBL_983404 (CHEMBL2429074)
IC50
5100±n/a nM
Citation
 James, LIKorboukh, VKKrichevsky, LBaughman, BMHerold, JMNorris, JLJin, JKireev, DBJanzen, WPArrowsmith, CHFrye, SV Small-molecule ligands of methyl-lysine binding proteins: optimization of selectivity for L3MBTL3. J Med Chem 56:7358-71 (2013)  
Target
Name:
MBT domain-containing protein 1
Synonyms:
MBT domain-containing protein 1 MBTD1 | MBTD1_HUMAN
Type:
Protein
Mol. Mass.:
70557.67
Organism:
Homo sapiens (Human)
Description:
Residue:
628
  
Inhibitor
Name:
BDBM50440605
Synonyms:
CHEMBL2424677
Type:
Small organic molecule
Emp. Form.:
C33H39N5O2
Mol. Mass.:
537.6951
SMILES:
CCN1Cc2ccc(NC(=O)c3ccc(C(=O)N4CCC(CC4)C4CCCN4)c(Nc4ccccc4)c3)cc2C1
: