Target
3-oxoacyl-[acyl-carrier-protein] reductase
Ligand
BDBM50070942
Substrate
Meas. Tech.
ChEMBL_983602 (CHEMBL2427114)
IC50
320±n/a nM
Citation
 Belluti, FPerozzo, RLauciello, LColizzi, FKostrewa, DBisi, AGobbi, SRampa, ABolognesi, MLRecanatini, MBrun, RScapozza, LCavalli, A Design, synthesis, and biological and crystallographic evaluation of novel inhibitors of Plasmodium falciparum enoyl-ACP-reductase (PfFabI). J Med Chem 56:7516-26 (2013)  
Target
Name:
3-oxoacyl-[acyl-carrier-protein] reductase
Synonyms:
3-oxoacyl-(Acyl-carrier protein) reductase | FabG
Type:
PROTEIN
Mol. Mass.:
33360.55
Organism:
Plasmodium falciparum (isolate 3D7)
Description:
ChEMBL_107660
Residue:
301
  
Inhibitor
Name:
BDBM50070942
Synonyms:
(-)-Epigallocatechin gallate (-)-epigallocatechin 3-gallate CHEMBL297453 Epigallocatechin 3-gallate cid_65064
Type:
Small organic molecule
Emp. Form.:
C22H18O11
Mol. Mass.:
458.3717
SMILES:
Oc1cc(O)c2C[C@@H](OC(=O)c3cc(O)c(O)c(O)c3)[C@H](Oc2c1)c1cc(O)c(O)c(O)c1
: