Target
Polyunsaturated fatty acid 5-lipoxygenase
Ligand
BDBM50440644
Substrate
Meas. Tech.
ChEMBL_985247 (CHEMBL2434497)
IC50
370000±n/a nM
Citation
  TBA Med Chem Res 0:1-22 (2013)    Article 
Target
Name:
Polyunsaturated fatty acid 5-lipoxygenase
Synonyms:
Alox5 LOX5_RAT
Type:
PROTEIN
Mol. Mass.:
78082.31
Organism:
Rattus norvegicus
Description:
ChEMBL_1432947
Residue:
673
  
Inhibitor
Name:
BDBM50440644
Synonyms:
CHEMBL262070
Type:
Small organic molecule
Emp. Form.:
C17H16O3
Mol. Mass.:
268.3071
SMILES:
COc1cccc(OC)c1\C=C\C(=O)c1ccccc1
: