Target
Polyunsaturated fatty acid 5-lipoxygenase
Ligand
BDBM50042983
Substrate
Meas. Tech.
ChEMBL_985247 (CHEMBL2434497)
IC50
17000±n/a nM
Citation
  TBA Med Chem Res 0:1-22 (2013)    Article 
Target
Name:
Polyunsaturated fatty acid 5-lipoxygenase
Synonyms:
Alox5 LOX5_RAT
Type:
PROTEIN
Mol. Mass.:
78082.31
Organism:
Rattus norvegicus
Description:
ChEMBL_1432947
Residue:
673
  
Inhibitor
Name:
BDBM50042983
Synonyms:
3-(4-Hydroxy-3-methoxy-phenyl)-1-(2-hydroxy-phenyl)-propenone | CHEMBL130640
Type:
Small organic molecule
Emp. Form.:
C16H14O4
Mol. Mass.:
270.28
SMILES:
COc1cc(\C=C\C(=O)c2ccccc2O)ccc1O
: