Target
Probable G-protein coupled receptor 142
Ligand
BDBM50440713
Substrate
Meas. Tech.
ChEMBL_985961 (CHEMBL2432193)
EC50
37±n/a nM
Citation
 Yu, MLizarzaburu, MMotani, AFu, ZDu, XLiu, JJJiao, XLai, SFan, PFu, ALiu, QMurakoshi, MNara, FOda, KOkuyama, RReagan, JDWatanabe, NYamazaki, MXiong, YZhang, YZhuang, RLin, DCHouze, JBMedina, JCLi, L Aminopyrazole-Phenylalanine Based GPR142 Agonists: Discovery of Tool Compound and in Vivo Efficacy Studies. ACS Med Chem Lett 4:829-34 (2013)  
Target
Name:
Probable G-protein coupled receptor 142
Synonyms:
G-protein coupled receptor PGR2 GPR142 | PGR2
Type:
PROTEIN
Mol. Mass.:
51127.50
Organism:
Homo sapiens (Human)
Description:
ChEMBL_985961
Residue:
462
  
Inhibitor
Name:
BDBM50440713
Synonyms:
CHEMBL2430977
Type:
Small organic molecule
Emp. Form.:
C23H25N7OS
Mol. Mass.:
447.556
SMILES:
CNc1cc(ccn1)-c1cc(NC(=O)[C@H](Cc2ccccc2)NCc2cncs2)n(C)n1
: