Target
Calcitonin gene-related peptide type 1 receptor
Ligand
BDBM50385314
Substrate
Meas. Tech.
ChEMBL_986467 (CHEMBL2434392)
Ki
0.040000±n/a nM
Citation
 Bell, IMGallicchio, SNStump, CABruno, JGFan, HGantert, LTHostetler, EDKemmerer, ALMcWherter, MMoore, ELMosser, SDPurcell, MLRiffel, KSalvatore, CASanabria-Bohórquez, SStaas, DDWhite, RBWilliams, MZartman, CBCook, JJHargreaves, RJKane, SAGraham, SLSelnick, HG [(11)C]MK-4232: The First Positron Emission Tomography Tracer for the Calcitonin Gene-Related Peptide Receptor. ACS Med Chem Lett 4:863-8 (2013)  
Target
Name:
Calcitonin gene-related peptide type 1 receptor
Synonyms:
Adrenomedullin receptor AM1; CALCRL/RAMP2 CALRL_HUMAN CGRP type 1 receptor mRNA Calcitonin gene-related peptide (CGRP) receptor Calcitonin receptor-like receptor Human CL receptor
Type:
Enzyme Catalytic Domain
Mol. Mass.:
52980.45
Organism:
Homo sapiens (Human)
Description:
Q16602
Residue:
461
  
Inhibitor
Name:
BDBM50385314
Synonyms:
CHEMBL2035981
Type:
Small organic molecule
Emp. Form.:
C32H31F2N5O3
Mol. Mass.:
571.617
SMILES:
C[C@]1(CNC2(CCCC2)C(=O)N1CC(=O)Nc1ccc2C[C@]3(Cc2c1)C(=O)Nc1ncccc31)c1cc(F)cc(F)c1
: