Target
Phosphatidylinositol 4,5-bisphosphate 3-kinase catalytic subunit beta isoform
Ligand
BDBM50440794
Substrate
Meas. Tech.
ChEMBL_983839 (CHEMBL2433111)
IC50
1.6±n/a nM
Citation
 Abdel-Magid, AF Inhibitors of PI3K? as Potential Treatment for Cancer. ACS Med Chem Lett 4:815-6 (2013)  
Target
Name:
Phosphatidylinositol 4,5-bisphosphate 3-kinase catalytic subunit beta isoform
Synonyms:
PI3-kinase p110 subunit beta PI3Kbeta PIK3CB Phosphatidylinositol 4,5-bisphosphate 3-kinase catalytic subunit beta (PI3Kbeta) Phosphatidylinositol 4,5-bisphosphate 3-kinase catalytic subunit beta isoform (PI3K) Phosphatidylinositol 4,5-bisphosphate 3-kinase catalytic subunit beta isoform (PI3Kbeta) Phosphatidylinositol-4,5-bisphosphate 3-kinase catalytic subunit beta isoform Phosphoinositide 3-Kinase (PI3K), beta Chain A PtdIns-3-kinase p110
Type:
Enzyme Subunit
Mol. Mass.:
122769.00
Organism:
Homo sapiens (Human)
Description:
P42338
Residue:
1070
  
Inhibitor
Name:
BDBM50440794
Synonyms:
CHEMBL2431396
Type:
Small organic molecule
Emp. Form.:
C20H21ClN4O3
Mol. Mass.:
400.859
SMILES:
Cc1nc2c(cc(nc2n1Cc1cccc(Cl)c1C)N1CCOCC1)C(O)=O
: