Target
Coagulation factor X
Ligand
BDBM50440832
Substrate
Meas. Tech.
ChEMBL_983889 (CHEMBL2433499)
Ki
>8000±n/a nM
Citation
 Glunz, PWZhang, XZou, YDelucca, INirschl, AHCheng, XWeigelt, CACheney, DLWei, AAnumula, RLuettgen, JMRendina, ARHarpel, MLuo, GKnabb, RWong, PCWexler, RRPriestley, ES Nonbenzamidine acylsulfonamide tissue factor-factor VIIa inhibitors. Bioorg Med Chem Lett 23:5244-8 (2013)  
Target
Name:
Coagulation factor X
Synonyms:
Activated coagulation factor X (FXa) Coagulation factor X precursor F10 Factor X heavy chain Factor Xa Stuart-Prower factor
Type:
Enzyme
Mol. Mass.:
54726.60
Organism:
Homo sapiens (Human)
Description:
Residue:
488
  
Inhibitor
Name:
BDBM50440832
Synonyms:
CHEMBL2431610
Type:
Small organic molecule
Emp. Form.:
C28H30N4O7S2
Mol. Mass.:
598.69
SMILES:
CCOc1cc(ccc1OC(C)C)C(Nc1ccc2cnccc2c1)C(=O)NS(=O)(=O)c1ccc(cc1)S(N)(=O)=O
: