Target
Coagulation factor X
Ligand
BDBM50440822
Substrate
Meas. Tech.
ChEMBL_983889 (CHEMBL2433499)
Ki
5900±n/a nM
Citation
 Glunz, PWZhang, XZou, YDelucca, INirschl, AHCheng, XWeigelt, CACheney, DLWei, AAnumula, RLuettgen, JMRendina, ARHarpel, MLuo, GKnabb, RWong, PCWexler, RRPriestley, ES Nonbenzamidine acylsulfonamide tissue factor-factor VIIa inhibitors. Bioorg Med Chem Lett 23:5244-8 (2013)  
Target
Name:
Coagulation factor X
Synonyms:
Activated coagulation factor X (FXa) Coagulation factor X precursor F10 Factor X heavy chain Factor Xa Stuart-Prower factor
Type:
Enzyme
Mol. Mass.:
54726.60
Organism:
Homo sapiens (Human)
Description:
Residue:
488
  
Inhibitor
Name:
BDBM50440822
Synonyms:
CHEMBL2431602
Type:
Small organic molecule
Emp. Form.:
C28H31N5O7S2
Mol. Mass.:
613.705
SMILES:
CCOc1cc(ccc1OC(C)C)[C@@H](Nc1ccc2c(N)nccc2c1)C(=O)NS(=O)(=O)c1cccc(c1)S(N)(=O)=O
: