Target
Proteinase-activated receptor 2
Ligand
BDBM50440871
Substrate
Meas. Tech.
ChEMBL_984148 (CHEMBL2432076)
IC50
50000±n/a nM
Citation
 Yau, MKLiu, LFairlie, DP Toward drugs for protease-activated receptor 2 (PAR2). J Med Chem 56:7477-97 (2013)  
Target
Name:
Proteinase-activated receptor 2
Synonyms:
F2rl1 Par2
Type:
Enzyme Catalytic Domain
Mol. Mass.:
44466.34
Organism:
RAT
Description:
PAR2 F2RL1 RAT::Q63645
Residue:
397
  
Inhibitor
Name:
BDBM50440871
Synonyms:
CHEMBL2431725
Type:
Small organic molecule
Emp. Form.:
C39H60N10O8
Mol. Mass.:
796.9559
SMILES:
[#6]-[#6](-[#6])-[#6]-[#6@H](-[#7]-[#6](=O)-[#6@H](-[#6]-[#8])-[#7]-[#6](=O)-[#6@@H](-[#7])-[#6]-c1ccccc1)-[#6](=O)-[#7]-[#6@@H](-[#6]-[#6](-[#6])-[#6])-[#6](=O)-[#7]-[#6@@H](-[#6]-[#6]-[#6]\[#7]=[#6](/[#7])-[#7])-[#6](=O)-[#7]-[#6@@H](-[#6]-c1ccc(-[#8])cc1)-[#6](-[#7])=O
: