Target
Hepatocyte growth factor receptor
Ligand
BDBM50440879
Substrate
Meas. Tech.
ChEMBL_984696 (CHEMBL2434668)
Ki
3.0±n/a nM
Citation
 Cui, JJShen, HTran-Dubé, MNambu, MMcTigue, MGrodsky, NRyan, KYamazaki, SAguirre, SParker, MLi, QZou, HChristensen, J Lessons from (S)-6-(1-(6-(1-methyl-1H-pyrazol-4-yl)-[1,2,4]triazolo[4,3-b]pyridazin-3-yl)ethyl)quinoline (PF-04254644), an inhibitor of receptor tyrosine kinase c-Met with high protein kinase selectivity but broad phosphodiesterase family inhibition leading to myocardial degeneration in rats. J Med Chem 56:6651-65 (2013)  
Target
Name:
Hepatocyte growth factor receptor
Synonyms:
Hepatocyte growth factor receptor Hepatocyte growth factor receptor (c-MET) MET Met proto-oncogene (hepatocyte growth factor receptor) Tyrosine-protein kinase Met (c-Met) c-Met kinase
Type:
Protein
Mol. Mass.:
155559.73
Organism:
Homo sapiens (Human)
Description:
P08581
Residue:
1390
  
Inhibitor
Name:
BDBM50440879
Synonyms:
CHEMBL2431824
Type:
Small organic molecule
Emp. Form.:
C24H21N5O
Mol. Mass.:
395.4564
SMILES:
COc1ccc(cc1C)-c1ccc2nnc([C@@H](C)c3ccc4ncccc4c3)n2n1
: