Target
Histone deacetylase 3/Nuclear receptor corepressor 2 (HDAC3/NCoR2)
Ligand
BDBM22449
Substrate
Meas. Tech.
ChEMBL_984751 (CHEMBL2432125)
IC50
1270±n/a nM
Citation
 Blackburn, CBarrett, CChin, JGarcia, KGigstad, KGould, AGutierrez, JHarrison, SHoar, KLynch, CRowland, RSTsu, CRingeling, JXu, H Potent histone deacetylase inhibitors derived from 4-(aminomethyl)-N-hydroxybenzamide with high selectivity for the HDAC6 isoform. J Med Chem 56:7201-11 (2013)  
Target
Name:
Histone deacetylase 3/Nuclear receptor corepressor 2 (HDAC3/NCoR2)
Synonyms:
HDAC3/NcoR2 Complex | Histone deacetylase 3/Nuclear receptor corepressor 2
Type:
Mol. Mass.:
Description:
ASSAY_ID of ChEMBL is 2146499
Components:
This complex has 2 components.
Component 1
Name:
Histone deacetylase 3
Synonyms:
HD3 HDAC3_HUMAN Human HDAC3 SMAP45
Type:
Enzyme
Mol. Mass.:
48829.55
Organism:
Homo sapiens (Human)
Description:
O15379
Residue:
428
  
Component 2
Name:
Nuclear receptor corepressor 2
Synonyms:
CTG repeat protein 26 Histone deacetylase 2/Nuclear receptor corepressor 2 NCOR2 Nuclear receptor corepressor 2 SMAP270 Silencing mediator of retinoic acid and thyroid hormone receptor TRAC | Thyroid-, retinoic-acid-receptor-associated corepressor
Type:
Enzyme
Mol. Mass.:
274839.59
Organism:
Homo sapiens (Human)
Description:
Q9Y618
Residue:
2514
  
Inhibitor
Name:
BDBM22449
Synonyms:
CHEMBL356769 Tubacin | US9249087, Tubastatin A
Type:
Small organic molecule
Emp. Form.:
C41H43N3O7S
Mol. Mass.:
721.861
SMILES:
OCc1ccc(cc1)[C@@H]1C[C@H](CSc2nc(c(o2)-c2ccccc2)-c2ccccc2)O[C@@H](O1)c1ccc(NC(=O)CCCCCCC(=O)NO)cc1
: