Target
Nitric oxide synthase, inducible
Ligand
BDBM50441010
Substrate
Meas. Tech.
ChEMBL_985694 (CHEMBL2433625)
Ki
40829±n/a nM
Citation
 Jing, QLi, HChreifi, GRoman, LJMartásek, PPoulos, TLSilverman, RB Chiral linkers to improve selectivity of double-headed neuronal nitric oxide synthase inhibitors. Bioorg Med Chem Lett 23:5674-9 (2013)  
Target
Name:
Nitric oxide synthase, inducible
Synonyms:
Inducible NO synthase Inducible nitric oxide synthase (iNOS) MAC-NOS NOS type II Nitric Oxide Synthase, inducible Nos2
Type:
Enzyme
Mol. Mass.:
130595.79
Organism:
Mus musculus (mouse)
Description:
Recombinant enzyme overexpressed in E. coli.
Residue:
1144
  
Inhibitor
Name:
BDBM50441010
Synonyms:
CHEMBL2430143 | US9732037, Compound 14
Type:
Small organic molecule
Emp. Form.:
C17H25N5O2
Mol. Mass.:
331.4127
SMILES:
Cc1cc(N)nc(COC[C@H](CN)OCc2cc(C)cc(N)n2)c1
: