Target
L-lactate dehydrogenase B chain
Ligand
BDBM50441119
Substrate
Meas. Tech.
ChEMBL_984203 (CHEMBL2432256)
IC50
7000±n/a nM
Citation
 Fauber, BPDragovich, PSChen, JCorson, LBDing, CZEigenbrot, CGiannetti, AMHunsaker, TLabadie, SLiu, YLiu, YMalek, SPeterson, DPitts, KSideris, SUltsch, MVanderPorten, EWang, JWei, BYen, IYue, Q Identification of 2-amino-5-aryl-pyrazines as inhibitors of human lactate dehydrogenase. Bioorg Med Chem Lett 23:5533-9 (2013)  
Target
Name:
L-lactate dehydrogenase B chain
Synonyms:
L-lactate dehydrogenase B LDH heart subunit LDH-H LDHB_HUMAN Renal carcinoma antigen NY-REN-46
Type:
Oxidoreductase; homotetramer
Mol. Mass.:
36635.55
Organism:
Homo sapiens (Human)
Description:
Residue:
334
  
Inhibitor
Name:
BDBM50441119
Synonyms:
CHEMBL2430733
Type:
Small organic molecule
Emp. Form.:
C22H24N4O2
Mol. Mass.:
376.4516
SMILES:
CC(C)c1ccc(cc1-c1cnc(N)c(N[C@H](C)c2ccccc2)n1)C(O)=O
: