Target
Hexokinase-4
Ligand
BDBM50441150
Substrate
Meas. Tech.
ChEMBL_984799 (CHEMBL2432301)
EC50
7780±n/a nM
Citation
 Hinklin, RJBoyd, SAChicarelli, MJCondroski, KRDeWolf, WELee, PALee, WSingh, AThomas, LVoegtli, WCWilliams, LAicher, TD Identification of a new class of glucokinase activators through structure-based design. J Med Chem 56:7669-78 (2013)  
Target
Name:
Hexokinase-4
Synonyms:
GCK Glucokinase (GK) HK IV HXK4_HUMAN Hexokinase-D
Type:
Enzyme
Mol. Mass.:
52175.81
Organism:
Homo sapiens (Human)
Description:
P35557
Residue:
465
  
Inhibitor
Name:
BDBM50441150
Synonyms:
CHEMBL2430865
Type:
Small organic molecule
Emp. Form.:
C15H14N4OS
Mol. Mass.:
298.363
SMILES:
Cc1csc(Nc2ncccc2OCc2cccnc2)n1
: