Target
Bromodomain-containing protein 2
Ligand
BDBM50441168
Substrate
Meas. Tech.
ChEMBL_985088 (CHEMBL2433593)
IC50
2512±n/a nM
Citation
 Mirguet, OGosmini, RToum, JClément, CABarnathan, MBrusq, JMMordaunt, JEGrimes, RMCrowe, MPineau, OAjakane, MDaugan, AJeffrey, PCutler, LHaynes, ACSmithers, NNChung, CWBamborough, PUings, IJLewis, AWitherington, JParr, NPrinjha, RKNicodème, E Discovery of epigenetic regulator I-BET762: lead optimization to afford a clinical candidate inhibitor of the BET bromodomains. J Med Chem 56:7501-15 (2013)  
Target
Name:
Bromodomain-containing protein 2
Synonyms:
BRD2 Bromodomain and extra-terminal motif (BET) Bromodomain-containing protein 2 (BRD2) RING3
Type:
Protein
Mol. Mass.:
88085.95
Organism:
Homo sapiens (Human)
Description:
P25440
Residue:
801
  
Inhibitor
Name:
BDBM50441168
Synonyms:
CHEMBL2430873
Type:
Small organic molecule
Emp. Form.:
C20H19N5O2
Mol. Mass.:
361.3972
SMILES:
CCOC(=O)N[C@@H]1N=C(c2ccccc2)c2ccccc2-n2c(C)nnc12
: