Target
Hepatocyte growth factor receptor
Ligand
BDBM50399540
Substrate
Meas. Tech.
ChEMBL_987834 (CHEMBL2437782)
IC50
1.1±n/a nM
Citation
 Tang, QZhao, YDu, XChong, LGong, PGuo, C Design, synthesis, and structure-activity relationships of novel 6,7-disubstituted-4-phenoxyquinoline derivatives as potential antitumor agents. Eur J Med Chem 69:77-89 (2013)  
Target
Name:
Hepatocyte growth factor receptor
Synonyms:
Hepatocyte growth factor receptor Hepatocyte growth factor receptor (c-MET) MET Met proto-oncogene (hepatocyte growth factor receptor) Tyrosine-protein kinase Met (c-Met) c-Met kinase
Type:
Protein
Mol. Mass.:
155559.73
Organism:
Homo sapiens (Human)
Description:
P08581
Residue:
1390
  
Inhibitor
Name:
BDBM50399540
Synonyms:
FORETINIB US10882853, Compound For-Oxide
Type:
Small organic molecule
Emp. Form.:
C34H34F2N4O6
Mol. Mass.:
632.6538
SMILES:
COc1cc2c(Oc3ccc(NC(=O)C4(CC4)C(=O)Nc4ccc(F)cc4)cc3F)ccnc2cc1OCCCN1CCOCC1
: