Target
Heme oxygenase 2
Ligand
BDBM50441447
Substrate
Meas. Tech.
ChEMBL_988011 (CHEMBL2438669)
IC50
3500±n/a nM
Citation
 Vlahakis, JZVukomanovic, DNakatsu, KSzarek, WA Selective inhibition of heme oxygenase-2 activity by analogs of 1-(4-chlorobenzyl)-2-(pyrrolidin-1-ylmethyl)-1H-benzimidazole (clemizole): Exploration of the effects of substituents at the N-1 position. Bioorg Med Chem 21:6788-95 (2013)  
Target
Name:
Heme oxygenase 2
Synonyms:
HMOX2_RAT Heme oxygenase 2 | Hmox2
Type:
Enzyme
Mol. Mass.:
35754.99
Organism:
Rattus norvegicus (rat)
Description:
HO-2 obtained from rat brain was used in enzyme assays.
Residue:
315
  
Inhibitor
Name:
BDBM50441447
Synonyms:
CHEMBL2436295
Type:
Small organic molecule
Emp. Form.:
C19H20N4O2
Mol. Mass.:
336.3877
SMILES:
[O-][N+](=O)c1ccccc1Cn1c(CN2CCCC2)nc2ccccc12
: