Target
Bifunctional epoxide hydrolase 2
Ligand
BDBM50441472
Substrate
Meas. Tech.
ChEMBL_988347 (CHEMBL2437610)
IC50
5.3±n/a nM
Citation
 Kato, YFuchi, NSaburi, HNishimura, YWatanabe, AYagi, MNakadera, YHigashi, EYamada, MAoki, T Discovery of 2,8-diazaspiro[4.5]decane-based trisubstituted urea derivatives as highly potent soluble epoxide hydrolase inhibitors and orally active drug candidates for treating hypertension. Bioorg Med Chem Lett 23:5975-9 (2013)  
Target
Name:
Bifunctional epoxide hydrolase 2
Synonyms:
Ephx2 HYES_RAT
Type:
PROTEIN
Mol. Mass.:
62337.15
Organism:
Rattus norvegicus
Description:
ChEMBL_1465995
Residue:
554
  
Inhibitor
Name:
BDBM50441472
Synonyms:
CHEMBL2436578
Type:
Small organic molecule
Emp. Form.:
C21H23F3N4O4
Mol. Mass.:
452.4269
SMILES:
Cc1cc(no1)C(=O)N1CCC2(CCN(C2)C(=O)Nc2ccc(OC(F)(F)F)cc2)CC1
: