Target
Bifunctional epoxide hydrolase 2
Ligand
BDBM50441467
Substrate
Meas. Tech.
ChEMBL_988348 (CHEMBL2437611)
IC50
11±n/a nM
Citation
 Kato, YFuchi, NSaburi, HNishimura, YWatanabe, AYagi, MNakadera, YHigashi, EYamada, MAoki, T Discovery of 2,8-diazaspiro[4.5]decane-based trisubstituted urea derivatives as highly potent soluble epoxide hydrolase inhibitors and orally active drug candidates for treating hypertension. Bioorg Med Chem Lett 23:5975-9 (2013)  
Target
Name:
Bifunctional epoxide hydrolase 2
Synonyms:
Eph2 Epoxide hydratase Soluble epoxide hydrolase (sEH)
Type:
Enzyme
Mol. Mass.:
62512.06
Organism:
Mus musculus (Mouse)
Description:
P34914
Residue:
554
  
Inhibitor
Name:
BDBM50441467
Synonyms:
CHEMBL2436573
Type:
Small organic molecule
Emp. Form.:
C23H23F4N3O4
Mol. Mass.:
481.44
SMILES:
Oc1ccc(F)c(c1)C(=O)N1CCC2(CCN(C2)C(=O)Nc2ccc(OC(F)(F)F)cc2)CC1
: