Target
Mitogen-activated protein kinase kinase kinase 11
Ligand
BDBM50441568
Substrate
Meas. Tech.
ChEMBL_986642 (CHEMBL2437702)
IC50
510±n/a nM
Citation
 Goodfellow, VSLoweth, CJRavula, SBWiemann, TNguyen, TXu, YTodd, DESheppard, DPollack, SPolesskaya, OMarker, DFDewhurst, SGelbard, HA Discovery, synthesis, and characterization of an orally bioavailable, brain penetrant inhibitor of mixed lineage kinase 3. J Med Chem 56:8032-48 (2013)  
Target
Name:
Mitogen-activated protein kinase kinase kinase 11
Synonyms:
M3K11_MOUSE Mixed lineage kinase 3 | Mlk3
Type:
PROTEIN
Mol. Mass.:
93237.89
Organism:
Mus musculus
Description:
ChEMBL_107667
Residue:
850
  
Inhibitor
Name:
BDBM50441568
Synonyms:
CHEMBL2436983 US9814704, Example 9
Type:
Small organic molecule
Emp. Form.:
C19H14N6
Mol. Mass.:
326.3547
SMILES:
Nc1ncc(cn1)-c1cnc2[nH]cc(-c3ccc4[nH]ccc4c3)c2c1
: