Target
Cyclin-dependent kinase 1
Ligand
BDBM50441567
Substrate
Meas. Tech.
ChEMBL_988913 (CHEMBL2439767)
IC50
1125±n/a nM
Citation
 Goodfellow, VSLoweth, CJRavula, SBWiemann, TNguyen, TXu, YTodd, DESheppard, DPollack, SPolesskaya, OMarker, DFDewhurst, SGelbard, HA Discovery, synthesis, and characterization of an orally bioavailable, brain penetrant inhibitor of mixed lineage kinase 3. J Med Chem 56:8032-48 (2013)  
Target
Name:
Cyclin-dependent kinase 1
Synonyms:
CDC2 CDK1 CDKN1 Cell division protein kinase 1 P34CDC2 | p34 protein kinase
Type:
Enzyme Subunit
Mol. Mass.:
34101.08
Organism:
Homo sapiens (Human)
Description:
P06493
Residue:
297
  
Inhibitor
Name:
BDBM50441567
Synonyms:
CHEMBL2436978 | US10485800, Example 181
Type:
Small organic molecule
Emp. Form.:
C27H27N5
Mol. Mass.:
421.5368
SMILES:
CN1CCN(Cc2ccc(cc2)-c2cnc3[nH]cc(-c4ccc5[nH]ccc5c4)c3c2)CC1
: