Target
Receptor-type tyrosine-protein kinase FLT3
Ligand
BDBM50441566
Substrate
Meas. Tech.
ChEMBL_988769 (CHEMBL2439142)
IC50
730±n/a nM
Citation
 Goodfellow, VSLoweth, CJRavula, SBWiemann, TNguyen, TXu, YTodd, DESheppard, DPollack, SPolesskaya, OMarker, DFDewhurst, SGelbard, HA Discovery, synthesis, and characterization of an orally bioavailable, brain penetrant inhibitor of mixed lineage kinase 3. J Med Chem 56:8032-48 (2013)  
Target
Name:
Receptor-type tyrosine-protein kinase FLT3
Synonyms:
CD135 FL cytokine receptor FLK2 FLT3 Fetal liver kinase-2 Fms-like tyrosine kinase 3 (Flt-3) STK-1 Stem cell tyrosine kinase 1
Type:
Enzyme
Mol. Mass.:
112888.62
Organism:
Homo sapiens (Human)
Description:
P36888
Residue:
993
  
Inhibitor
Name:
BDBM50441566
Synonyms:
CHEMBL2436977 | US10485800, Example 179
Type:
Small organic molecule
Emp. Form.:
C26H26N6
Mol. Mass.:
422.5248
SMILES:
CN1CCN(Cc2ccc(cc2)-c2cnc3[nH]cc(-c4cnc5[nH]ccc5c4)c3c2)CC1
: