Target
Renin
Ligand
BDBM18038
Substrate
Meas. Tech.
ChEMBL_987020 (CHEMBL2439340)
IC50
58±n/a nM
Citation
 Shultz, MD The thermodynamic basis for the use of lipophilic efficiency (LipE) in enthalpic optimizations. Bioorg Med Chem Lett 23:5992-6000 (2013)  
Target
Name:
Renin
Synonyms:
Angiotensinogenase RENI_HUMAN
Type:
Enzyme
Mol. Mass.:
45058.99
Organism:
Homo sapiens (Human)
Description:
Residue:
406
  
Inhibitor
Name:
BDBM18038
Synonyms:
6-ethyl-5-[1-(3-methoxypropyl)-2-phenyl-1,2,3,4-tetrahydroquinolin-7-yl]pyrimidine-2,4-diamine | diaminopyrimidine renin inhibitor compound, 3
Type:
Small organic molecule
Emp. Form.:
C25H31N5O
Mol. Mass.:
417.5465
SMILES:
CCc1nc(N)nc(N)c1-c1ccc2CCC(N(CCCOC)c2c1)c1ccccc1
: