Target
E3 ubiquitin-protein ligase XIAP
Ligand
BDBM50441819
Substrate
Meas. Tech.
ChEMBL_988991 (CHEMBL2437637)
IC50
5.0±n/a nM
Citation
 Kester, RFDonnell, AFLou, YRemiszewski, SWLombardo, LJChen, SLe, NTLo, JMoliterni, JAHan, XHogg, JHLiang, WMichoud, CRupert, KCMischke, SLe, KWeisel, MJanson, CALukacs, CMFretland, AJHong, KPolonskaia, AGao, LLi, SSolis, DSAguilar, DTardell, CDvorozniak, MTannu, SLee, ECSchutt, ADGoggin, B Optimization of benzodiazepinones as selective inhibitors of the X-linked inhibitor of apoptosis protein (XIAP) second baculovirus IAP repeat (BIR2) domain. J Med Chem 56:7788-803 (2013)  
Target
Name:
E3 ubiquitin-protein ligase XIAP
Synonyms:
API3 E3 ubiquitin-protein ligase XIAP Inhibitor of apoptosis protein 3 X-linked inhibitor of apoptosis XIAP | XIAP_HUMAN
Type:
Protein
Mol. Mass.:
56685.27
Organism:
Homo sapiens (Human)
Description:
P98170
Residue:
497
  
Inhibitor
Name:
BDBM50441819
Synonyms:
CHEMBL2436209 | US10053431, 89b
Type:
Small organic molecule
Emp. Form.:
C31H30BrN5O4
Mol. Mass.:
616.505
SMILES:
CN[C@@H](C)C(=O)N[C@H]1CN(C(=O)c2cccnc2)c2ccccc2N(Cc2c(OC)ccc3cc(Br)ccc23)C1=O
: