Target
Sigma non-opioid intracellular receptor 1
Ligand
BDBM50441933
Substrate
Meas. Tech.
ChEMBL_987953 (CHEMBL2438376)
Ki
311±n/a nM
Citation
 Abate, CSelivanova, SVMüller, AKrämer, SDSchibli, RMarottoli, RPerrone, RBerardi, FNiso, MAmetamey, SM Development of 3,4-dihydroisoquinolin-1(2H)-one derivatives for the Positron Emission Tomography (PET) imaging ofs2 receptors. Eur J Med Chem 69:920-30 (2013)  
Target
Name:
Sigma non-opioid intracellular receptor 1
Synonyms:
OPRS1 SIGMAR1 Sigma non-opioid intracellular receptor 1 Sigma1-receptor Sterol isomerase-like protein
Type:
Protein
Mol. Mass.:
25307.17
Organism:
Cavia porcellus (Guinea pig)
Description:
Q60492
Residue:
223
  
Inhibitor
Name:
BDBM50441933
Synonyms:
CHEMBL2437383
Type:
Small organic molecule
Emp. Form.:
C23H27FN2O3
Mol. Mass.:
398.4705
SMILES:
COc1cc2CCN(CCCN3CCc4cc(F)ccc4C3=O)Cc2cc1OC
: