Target
Dipeptidyl peptidase 9
Ligand
BDBM50442190
Substrate
Meas. Tech.
ChEMBL_991616 (CHEMBL2444438)
Ki
2.8±n/a nM
Citation
 Devasthale, PWang, YWang, WFevig, JFeng, JWang, AHarrity, TEgan, DMorgan, NCap, MFura, AKlei, HEKish, KWeigelt, CSun, LLevesque, PMoulin, FLi, YXZahler, RKirby, MSHamann, LG Optimization of activity, selectivity, and liability profiles in 5-oxopyrrolopyridine DPP4 inhibitors leading to clinical candidate (Sa)-2-(3-(aminomethyl)-4-(2,4-dichlorophenyl)-2-methyl-5-oxo-5H-pyrrolo[3,4-b]pyridin-6(7H)-yl)-N,N-dimethylacetamide (BMS-767778). J Med Chem 56:7343-57 (2013)  
Target
Name:
Dipeptidyl peptidase 9
Synonyms:
DPP9 DPRP-2 Dipeptidyl peptidase 9 (DDP9) Dipeptidyl peptidase 9 (DPP9) Dipeptidyl peptidase IX Dipeptidyl peptidase-like protein 9
Type:
Enzyme
Mol. Mass.:
98260.70
Organism:
Homo sapiens (Human)
Description:
Q86TI2
Residue:
863
  
Inhibitor
Name:
BDBM50442190
Synonyms:
CHEMBL2441847
Type:
Small organic molecule
Emp. Form.:
C22H26Cl2N4O2
Mol. Mass.:
449.373
SMILES:
CCN(CC)C(=O)CCn1cc2[nH]c(C)c(CN)c(-c3ccc(Cl)cc3Cl)c2c1=O
: