Target
Hepatocyte growth factor receptor
Ligand
BDBM50442263
Substrate
Meas. Tech.
ChEMBL_992003 (CHEMBL2447158)
IC50
98±n/a nM
Citation
 Zhang, DZhang, XAi, JZhai, YLiang, ZWang, YChen, YLi, CZhao, FJiang, HGeng, MLuo, CLiu, H Synthesis and biological evaluation of 2-amino-5-aryl-3-benzylthiopyridine scaffold based potent c-Met inhibitors. Bioorg Med Chem 21:6804-20 (2013)  
Target
Name:
Hepatocyte growth factor receptor
Synonyms:
Hepatocyte growth factor receptor Hepatocyte growth factor receptor (c-MET) MET Met proto-oncogene (hepatocyte growth factor receptor) Tyrosine-protein kinase Met (c-Met) c-Met kinase
Type:
Protein
Mol. Mass.:
155559.73
Organism:
Homo sapiens (Human)
Description:
P08581
Residue:
1390
  
Inhibitor
Name:
BDBM50442263
Synonyms:
CHEMBL2442121
Type:
Small organic molecule
Emp. Form.:
C24H21Cl2F2N3O2S
Mol. Mass.:
524.41
SMILES:
CC(Sc1cc(cnc1N)-c1ccc(C(=O)N2CCOCC2)c(F)c1)c1c(Cl)ccc(F)c1Cl
: