Target
Hepatocyte growth factor receptor
Ligand
BDBM50442267
Substrate
Meas. Tech.
ChEMBL_992003 (CHEMBL2447158)
IC50
82±n/a nM
Citation
 Zhang, DZhang, XAi, JZhai, YLiang, ZWang, YChen, YLi, CZhao, FJiang, HGeng, MLuo, CLiu, H Synthesis and biological evaluation of 2-amino-5-aryl-3-benzylthiopyridine scaffold based potent c-Met inhibitors. Bioorg Med Chem 21:6804-20 (2013)  
Target
Name:
Hepatocyte growth factor receptor
Synonyms:
Hepatocyte growth factor receptor Hepatocyte growth factor receptor (c-MET) MET Met proto-oncogene (hepatocyte growth factor receptor) Tyrosine-protein kinase Met (c-Met) c-Met kinase
Type:
Protein
Mol. Mass.:
155559.73
Organism:
Homo sapiens (Human)
Description:
P08581
Residue:
1390
  
Inhibitor
Name:
BDBM50442267
Synonyms:
CHEMBL2442117
Type:
Small organic molecule
Emp. Form.:
C26H27Cl2FN4O2S
Mol. Mass.:
549.488
SMILES:
CC(Sc1cc(cnc1N)-c1ccc(cc1)C(=O)N1CCN(CCO)CC1)c1c(Cl)ccc(F)c1Cl
: