Target
Renin
Ligand
BDBM16034
Substrate
Meas. Tech.
ChEMBL_992315 (CHEMBL2445101)
IC50
>50000±n/a nM
Citation
 Suzuki, KHamada, YNguyen, JTKiso, Y Novel BACE1 inhibitors with a non-acidic heterocycle at the P1' position. Bioorg Med Chem 21:6665-73 (2013)  
Target
Name:
Renin
Synonyms:
Angiotensinogenase RENI_HUMAN
Type:
Enzyme
Mol. Mass.:
45058.99
Organism:
Homo sapiens (Human)
Description:
Residue:
406
  
Inhibitor
Name:
BDBM16034
Synonyms:
1-N-[(2S,3R)-4-(cyclopropylamino)-3-hydroxy-1-phenylbutan-2-yl]-5-(N-methylmethanesulfonamido)-3-N-[(1R)-1-phenylethyl]benzene-1,3-dicarboxamide CHEMBL378225 L-000384950 hydroxyethylamine (HEA) derived inhibitor 1
Type:
Small organic molecule
Emp. Form.:
C31H38N4O5S
Mol. Mass.:
578.722
SMILES:
C[C@@H](NC(=O)c1cc(cc(c1)C(=O)N[C@@H](Cc1ccccc1)[C@H](O)CNC1CC1)N(C)S(C)(=O)=O)c1ccccc1
: