Target
Potassium voltage-gated channel subfamily KQT member 2
Ligand
BDBM50410081
Substrate
Meas. Tech.
ChEMBL_990142 (CHEMBL2444337)
EC50
10.0±n/a nM
Citation
 Wu, YJConway, CMSun, LQMachet, FChen, JChen, PHe, HBourin, CCalandra, VPolino, JLDavis, CDHeman, KGribkoff, VKBoissard, CGKnox, RJThompson, MWFitzpatrick, WWeaver, DHarden, DGNatale, JDworetzky, SIStarrett, JE Discovery of (S,E)-3-(2-fluorophenyl)-N-(1-(3-(pyridin-3-yloxy)phenyl)ethyl)-acrylamide as a potent and efficacious KCNQ2 (Kv7.2) opener for the treatment of neuropathic pain. Bioorg Med Chem Lett 23:6188-91 (2013)  
Target
Name:
Potassium voltage-gated channel subfamily KQT member 2
Synonyms:
KCNQ2_MOUSE Kcnq2 Potassium channel subunit alpha KvLQT2 Voltage-gated potassium channel subunit Kv7.2
Type:
PROTEIN
Mol. Mass.:
84494.02
Organism:
Mus musculus
Description:
ChEMBL_990142
Residue:
759
  
Inhibitor
Name:
BDBM50410081
Synonyms:
CHEMBL361184
Type:
Small organic molecule
Emp. Form.:
C22H18F2N2O
Mol. Mass.:
364.3879
SMILES:
C[C@H](NC(=O)\C=C\c1ccccc1F)c1cccc(c1)-c1ccc(F)nc1
: