Target
Matrix metalloproteinase-14
Ligand
BDBM50442522
Substrate
Meas. Tech.
ChEMBL_990167 (CHEMBL2444631)
IC50
>100000±n/a nM
Citation
 Tauro, MLaghezza, ALoiodice, FAgamennone, MCampestre, CTortorella, P Arylamino methylene bisphosphonate derivatives as bone seeking matrix metalloproteinase inhibitors. Bioorg Med Chem 21:6456-65 (2013)  
Target
Name:
Matrix metalloproteinase-14
Synonyms:
MMP-14 MMP14 MT-MMP 1 MT1MMP Matrix Metalloproteinase-14 (MMP-14) Matrix metalloproteinase-14 Membrane-type matrix metalloproteinase 1 | Membrane-type-1 matrix metalloproteinase
Type:
Protein
Mol. Mass.:
65900.19
Organism:
Homo sapiens (Human)
Description:
P50281
Residue:
582
  
Inhibitor
Name:
BDBM50442522
Synonyms:
CHEMBL2440581
Type:
Small organic molecule
Emp. Form.:
C7H10FNO6P2
Mol. Mass.:
285.1033
SMILES:
OP(O)(=O)C(Nc1ccc(F)cc1)P(O)(O)=O
: