Target
Mineralocorticoid receptor
Ligand
BDBM50442531
Substrate
Meas. Tech.
ChEMBL_990492 (CHEMBL2446789)
EC50
14000±n/a nM
Citation
 Pandya, KDietrich, DSeibert, JVederas, JCOdermatt, A Synthesis of sterically encumbered 11ß-aminoprogesterone derivatives and evaluation as 11ß-hydroxysteroid dehydrogenase inhibitors and mineralocorticoid receptor antagonists. Bioorg Med Chem 21:6274-81 (2013)  
Target
Name:
Mineralocorticoid receptor
Synonyms:
MCR MLR NR3C2 | Nuclear receptor subfamily 3 group C member 2
Type:
Enzyme
Mol. Mass.:
107076.42
Organism:
Homo sapiens (Human)
Description:
P08235
Residue:
984
  
Inhibitor
Name:
BDBM50442531
Synonyms:
11BETA-HYDROXYPROGESTERONE
Type:
Small organic molecule
Emp. Form.:
C21H30O3
Mol. Mass.:
330.4611
SMILES:
CC(=O)[C@H]1CC[C@H]2[C@@H]3CCC4=CC(=O)CC[C@]4(C)[C@H]3[C@@H](O)C[C@]12C
: