Target
11-beta-hydroxysteroid dehydrogenase type 2
Ligand
BDBM50442531
Substrate
Meas. Tech.
ChEMBL_990496 (CHEMBL2446793)
IC50
490±n/a nM
Citation
 Pandya, KDietrich, DSeibert, JVederas, JCOdermatt, A Synthesis of sterically encumbered 11ß-aminoprogesterone derivatives and evaluation as 11ß-hydroxysteroid dehydrogenase inhibitors and mineralocorticoid receptor antagonists. Bioorg Med Chem 21:6274-81 (2013)  
Target
Name:
11-beta-hydroxysteroid dehydrogenase type 2
Synonyms:
11-DH2 11-beta-Hydroxysteroid Dehydrogenase 2 (11-beta-HSD2) 11-beta-hydroxysteroid dehydrogenase 2 11-beta-hydroxysteroid dehydrogenase type 2 (11-beta-HSD2) DHI2_HUMAN HSD11K SDR9C3
Type:
Enzyme
Mol. Mass.:
44141.72
Organism:
Homo sapiens (Human)
Description:
Purified recombinant human 11beta-HSD2.
Residue:
405
  
Inhibitor
Name:
BDBM50442531
Synonyms:
11BETA-HYDROXYPROGESTERONE
Type:
Small organic molecule
Emp. Form.:
C21H30O3
Mol. Mass.:
330.4611
SMILES:
CC(=O)[C@H]1CC[C@H]2[C@@H]3CCC4=CC(=O)CC[C@]4(C)[C@H]3[C@@H](O)C[C@]12C
: