Target
Transient receptor potential cation channel subfamily M member 8
Ligand
BDBM50318482
Substrate
Meas. Tech.
ChEMBL_989037 (CHEMBL2445667)
EC50
3000±n/a nM
Citation
 Brown, AEllis, DFavor, DAKirkup, TKlute, WMacKenny, MMcMurray, GStennett, A Serendipity in drug-discovery: a new series of 2-(benzyloxy)benzamides as TRPM8 antagonists. Bioorg Med Chem Lett 23:6118-22 (2013)  
Target
Name:
Transient receptor potential cation channel subfamily M member 8
Synonyms:
LTRPC6 TRPM8_HUMAN Transient receptor potential M8 protein (TRPM8) Transient receptor potential cation channel subfamily M member 8 (TRPM8)
Type:
Enzyme
Mol. Mass.:
127693.26
Organism:
Homo sapiens (Human)
Description:
Q7Z2W7
Residue:
1104
  
Inhibitor
Name:
BDBM50318482
Synonyms:
(-)-menthol MENTHOL l-menthol
Type:
Small organic molecule
Emp. Form.:
C10H20O
Mol. Mass.:
156.2652
SMILES:
CC(C)[C@@H]1CC[C@@H](C)C[C@H]1O
: