Target
Serine/threonine-protein kinase pim-3
Ligand
BDBM50442673
Substrate
Meas. Tech.
ChEMBL_989151 (CHEMBL2446214)
IC50
1.8±n/a nM
Citation
 Dwyer, MPKeertikar, KParuch, KAlvarez, CLabroli, MPoker, CFischmann, TOMayer-Ezell, RBond, RWang, YAzevedo, RGuzi, TJ Discovery of pyrazolo[1,5-a]pyrimidine-based Pim inhibitors: a template-based approach. Bioorg Med Chem Lett 23:6178-82 (2013)  
Target
Name:
Serine/threonine-protein kinase pim-3
Synonyms:
PIM3 Serine/threonine-protein kinase pim-3 (PIM3)
Type:
Protein
Mol. Mass.:
35888.19
Organism:
Homo sapiens (Human)
Description:
Q86V86
Residue:
326
  
Inhibitor
Name:
BDBM50442673
Synonyms:
CHEMBL2442291
Type:
Small organic molecule
Emp. Form.:
C17H17N7O
Mol. Mass.:
335.3632
SMILES:
Cc1nnc(o1)-c1cccc(c1)-c1cnn2ccc(NCCN)nc12
: