Target
Monocarboxylate transporter 4
Ligand
BDBM50442706
Substrate
Meas. Tech.
ChEMBL_989589 (CHEMBL2444904)
IC50
>30000±n/a nM
Citation
 Draoui, NSchicke, OFernandes, ADrozak, XNahra, FDumont, ADouxfils, JHermans, EDogné, JMCorbau, RMarchand, AChaltin, PSonveaux, PFeron, ORiant, O Synthesis and pharmacological evaluation of carboxycoumarins as a new antitumor treatment targeting lactate transport in cancer cells. Bioorg Med Chem 21:7107-17 (2013)  
Target
Name:
Monocarboxylate transporter 4
Synonyms:
MCT 4 MCT4 SLC16A3 | Solute carrier family 16 member 3
Type:
PROTEIN
Mol. Mass.:
49474.36
Organism:
Homo sapiens (Human)
Description:
ChEMBL_104604
Residue:
465
  
Inhibitor
Name:
BDBM50442706
Synonyms:
CHEMBL2442504
Type:
Small organic molecule
Emp. Form.:
C24H19NO4
Mol. Mass.:
385.412
SMILES:
OC(=O)c1cc2ccc(OCc3ccccc3)cc2n(Cc2ccccc2)c1=O
: